{"text_format":"1","workbook":"xlsx","n_sheets":8,"sheets":["SimpleCalc","FairPriceCalc","RUONIA","RUHolidays","FloatersQuotes","Roisfix_data","Roisfix_clean","RUONIA_QUOTES"],"not_rendered":{"charts":6,"images":2,"macros":1,"external_links":0,"defined_names":25,"comments":2,"pivot_tables":0},"unopened":[],"bounds":{"document_bytes":16777216,"sheet_cells":100000,"rows_first":2000,"rows_last":500,"rows_between":2000,"halvings":0,"cell_chars":16384,"cell_head_chars":4096},"cells_cut":0,"cells_raw":0,"read":"whole","date_system":"1900"}

{"sheet":"SimpleCalc","index":0,"n_rows":44,"n_cols":52,"rows_kept":44,"cut":false,"hidden":false,"merged":[[37,0,37,1],[38,0,38,1]]}
[null,null,null,null,null,null,null,null,null,null,null,null,null,"ПОКУПКА",null,"СР.ГЕОМ"]
["Дата",{"$f":"TODAY()","v":"2018-09-19"},null,"Вид ставки","СР.АРИФМ",null,null,null,null,null,null,null,null,"ПРОДАЖА",null,"СР.АРИФМ"]
[]
["Объем, млн",1000]
[]
["Стресс по ставке",0.01]
[]
["Период  фиксации ставки "]
["с",{"$f":"CurDate","v":"2018-09-19"}]
["по",{"$f":"tBegin+182","v":"2019-03-20"}]
[]
[]
["Сделка","ПОКУПКА"]
[]
["Получаем",{"$f":"IF(B13=\"ПРОДАЖА\",\"RUONIA\",\"ФИКС\"&\"=\"&ROUND(I43,2))","v":"ФИКС=7.65"},"Платим",{"$f":"IF(B13=\"ПОКУПКА\",\"RUONIA\",\"ФИКС\"&\"=\"&ROUND(I44,2))","v":"RUONIA"}]
[]
["ГО под позицию текущее, руб",{"$f":"Q36","v":10199512.504109589}]
["с учетом запаса под стресс",{"$f":"Q40","v":15027977.61221483}]
["Фондирование ГО",0.1]
["Расходы на ГО,% годовых",{"$f":"SUMPRODUCT(X24:X35,Y24:Y35)*B19/12/(10^6*B4)","v":3.4574067328767125E-4}]
{"$rows_left_out":25}
{"sheet":"FairPriceCalc","index":1,"n_rows":32,"n_cols":52,"rows_kept":32,"cut":false,"hidden":false,"merged":[[6,48,6,51],[30,48,30,51],[0,12,1,12],[6,37,6,39],[1,0,1,1],[0,11,1,11],[6,34,6,36],[30,37,30,39],[30,40,30,43],[6,40,6,43],[26,23,26,25],[30,34,30,36],[30,44,30,47],[6,44,6,47]]}
[null,"Дата",null,null,{"$f":"CurDate","v":"2018-09-19"},null,null,null,null,null,null,null,null,"ROISfix",{"$f":"Roisfix_data!A13","v":"19.09.2018"},null,null,null,null,null,null,null,null,null,null,null,null,null,null,null,null,null,null,null,null,null,null,null,null,null,null,null,null,null,null,"OIS кривая",1]
[null,null,null,null,null,null,null,null,null,null,null,null,null,1,{"$f":"VALUE(RUONIA!E2)","v":7.24},null,null,null,null,null,null,null,null,null,null,null,null,null,null,null,null,null,null,null,null,null,null,null,null,null,null,null,null,null,null,"Фьючерсная кривая",2]
[null,"Известная RUONIA",null,null,null,null,null,null,null,null,{"$f":"N2","v":1},null,null,7,{"$f":"VLOOKUP(N3,Roisfix_clean!$A$2:$C$8,3,FALSE)","v":7.34},null,null,null,null,null,null,null,null,null,null,null,null,null,null,null,null,null,null,null,null,null,null,null,null,null,null,null,null,null,null,"Своя кривая",3]
[null,"Число изв. дней",null,null,{"$f":"tCur-E13","v":19},null,null,null,null,null,7,null,null,14,{"$f":"VLOOKUP(N4,Roisfix_clean!$A$2:$C$8,3,FALSE)","v":7.34}]
[null,"Изв. cтавка",null,null,{"$f":"IF(SUMIFS(RUONIA!$G:$G,RUONIA!$I:$I,\">=\"&E13,RUONIA!$I:$I,\"<\"&E1)/E4=0,O2,SUMIFS(RUONIA!$G:$G,RUONIA!$I:$I,\">=\"&E13,RUONIA!$I:$I,\"<\"&E1)/E4)","v":7.0452631578947376},null,null,null,null,null,14,null,null,30,{"$f":"VLOOKUP(N5,Roisfix_clean!$A$2:$C$8,3,FALSE)","v":7.34}]
[null,"Дней в ближайшем",null,null,{"$f":"F13-E13","v":28},null,null,null,null,null,30,null,null,60,{"$f":"VLOOKUP(N6,Roisfix_clean!$A$2:$C$8,3,FALSE)","v":7.44},null,null,null,null,null,null,null,null,null,null,null,null,null,null,"Собственная форв кривая",null,null,null,"Расчет купонов по ОФЗ floaters"]
[null,"Осталось дней в ближ",null,null,{"$f":"F13-tCur","v":9},null,null,null,null,null,60,null,null,90,{"$f":"VLOOKUP(N7,Roisfix_clean!$A$2:$C$8,3,FALSE)","v":7.54},null,null,null,null,null,null,null,null,null,null,null,null,null,null,"Текущая ставка",{"$f":"C13&\".\"&RIGHT(D13,2)","v":"9.18"},7.2,null,"Облигация",24019,null,null,29011,null,null,29012,null,null,null,29006,null,null,null,29009]
[null,"Процент изв. дней",null,null,{"$f":"E4/E6","v":0.6785714285714286},null,null,null,null,null,90,null,null,182,{"$f":"VLOOKUP(N8,Roisfix_clean!$A$2:$C$8,3,FALSE)","v":7.86},null,null,null,null,null,null,null,null,null,null,null,null,null,null,"Ожидания  по ставке",{"$f":"C24&\".\"&RIGHT(D24,2)","v":"8.19"},8.4600000000000009,null,"Дата выплаты купона","2018-10-17","2019-04-17","2019-10-16","2019-01-30","2019-07-31","2020-01-29","2018-11-21","2019-05-22","2019-11-20","2020-05-20","2019-02-06","2019-08-07","2020-02-05","2020-08-05","2018-11-21","2019-05-22","2019-11-20","2020-05-20"]
[null,"pct_yield_coeff",null,null,{"$f":"E6/E7","v":3.1111111111111112},null,null,null,null,null,182,null,null,365,{"$f":"VLOOKUP(N9,Roisfix_clean!$A$2:$C$8,3,FALSE)","v":8.34},null,null,null,null,null,null,null,null,null,null,null,null,null,null,"Кфц наклона ",null,{"$f":"(AF8-AF7)/11","v":0.1145454545454546},null,"Начальная дата для расчета купона","2017-10-16","2018-04-16","2018-10-15","2018-01-29","2018-07-30","2019-01-28","2017-11-20","2018-05-21","2018-11-19","2019-05-20","2018-02-05","2018-08-06","2019-02-04","2019-08-05","2017-11-20","2018-05-21","2018-11-19","2019-05-20"]
[null,"pct_yield_total",null,null,{"$f":"E4/E6*E5","v":4.7807142857142866},null,null,null,null,null,null,null,null,null,null,null,null,null,null,null,null,null,null,null,null,null,null,null,null,null,null,null,null,"Конченая дата для расчета купона","2018-04-16","2018-10-15","2019-04-15","2018-07-30","2019-01-28","2019-07-29","2018-05-21","2018-11-19","2019-05-20","2019-11-18","2018-08-06","2019-02-04","2019-08-05","2020-02-03","2018-05-21","2018-11-19","2019-05-20","2019-11-18"]
[null,null,null,null,null,null,null,null,null,null,null,null,null,null,null,"Stress",{"$f":"stress*100","v":1},null,null,null,null,null,null,null,null,null,"Котировки рынка (ASK)",null,null,null,null,null,null,"Число дней с известной ставкой",{"$f":"SUMIFS(RUONIA!$F:$F,RUONIA!$I:$I,\">=\"&AI$9,RUONIA!$I:$I,\"<\"&AI$10)","v":182},{"$f":"SUMIFS(RUONIA!$F:$F,RUONIA!$I:$I,\">=\"&AJ$9,RUONIA!$I:$I,\"<\"&AJ$10)","v":156},{"$f":"SUMIFS(RUONIA!$F:$F,RUONIA!$I:$I,\">=\"&AK$9,RUONIA!$I:$I,\"<\"&AK$10)","v":0},{"$f":"SUMIFS(RUONIA!$F:$F,RUONIA!$I:$I,\">=\"&AL$9,RUONIA!$I:$I,\"<\"&AL$10)","v":182},{"$f":"SUMIFS(RUONIA!$F:$F,RUONIA!$I:$I,\">=\"&AM$9,RUONIA!$I:$I,\"<\"&AM$10)","v":51},{"$f":"SUMIFS(RUONIA!$F:$F,RUONIA!$I:$I,\">=\"&AN$9,RUONIA!$I:$I,\"<\"&AN$10)","v":0},{"$f":"SUMIFS(RUONIA!$F:$F,RUONIA!$I:$I,\">=\"&AO$9,RUONIA!$I:$I,\"<\"&AO$10)","v":182},{"$f":"SUMIFS(RUONIA!$F:$F,RUONIA!$I:$I,\">=\"&AP$9,RUONIA!$I:$I,\"<\"&AP$10)","v":121},{"$f":"SUMIFS(RUONIA!$F:$F,RUONIA!$I:$I,\">=\"&AQ$9,RUONIA!$I:$I,\"<\"&AQ$10)","v":0},{"$f":"SUMIFS(RUONIA!$F:$F,RUONIA!$I:$I,\">=\"&AR$9,RUONIA!$I:$I,\"<\"&AR$10)","v":0},{"$f":"SUMIFS(RUONIA!$F:$F,RUONIA!$I:$I,\">=\"&AS$9,RUONIA!$I:$I,\"<\"&AS$10)","v":182},{"$f":"SUMIFS(RUONIA!$F:$F,RUONIA!$I:$I,\">=\"&AT$9,RUONIA!$I:$I,\"<\"&AT$10)","v":44},{"$f":"SUMIFS(RUONIA!$F:$F,RUONIA!$I:$I,\">=\"&AU$9,RUONIA!$I:$I,\"<\"&AU$10)","v":0},{"$f":"SUMIFS(RUONIA!$F:$F,RUONIA!$I:$I,\">=\"&AV$9,RUONIA!$I:$I,\"<\"&AV$10)","v":0},{"$f":"SUMIFS(RUONIA!$F:$F,RUONIA!$I:$I,\">=\"&AW$9,RUONIA!$I:$I,\"<\"&AW$10)","v":182},{"$f":"SUMIFS(RUONIA!$F:$F,RUONIA!$I:$I,\">=\"&AX$9,RUONIA!$I:$I,\"<\"&AX$10)","v":121},{"$f":"SUMIFS(RUONIA!$F:$F,RUONIA!$I:$I,\">=\"&AY$9,RUONIA!$I:$I,\"<\"&AY$10)","v":0},{"$f":"SUMIFS(RUONIA!$F:$F,RUONIA!$I:$I,\">=\"&AZ$9,RUONIA!$I:$I,\"<\"&AZ$10)","v":0}]
["Месяц","Контракт",null,null,"Начало ставки","Дата экспирации","Дней до эксп",null,null,null,null,"Ставка OIS (геом. среднее)",null,"Форв. Кривая","Котировка фьючерса из ROISfix",null,null,null,null,null,null,"Дата заседания ЦБ","Ожидаемое изменени ставки","Накопленные ожидания по изменению ставки",null,null,"Котировки фьючерсов","Форв кривая",null,"Своя кривая месячная","Котировки фьючерсов","Форвардная кривая"]
[1,{"$f":"\"RUON-\"&C13&\".\"&RIGHT(D13,2)","v":"RUON-9.18"},{"$f":"MOD(MONTH($E$1)+A13-2,12)+1","v":9},{"$f":"YEAR($E$1)+INT(((MONTH($E$1)-2+A13)/12))","v":2018},{"$f":"Workday2(DATE(D13,C13,1),-1,65,RUHolidays!$A$1:$A$15)","v":"2018-08-31"},{"$f":"Workday2(DATE(D13,C13+1,1),-1,65,RUHolidays!$A$1:$A$15)","v":"2018-09-28"},{"$f":"F13-$E$1","v":9},{"$f":"MAX(IF($K$3:$K$9<=G13,$K$3:$K$9))","v":7},{"$f":"MIN(IF($N$3:$N$9>G13,$N$3:$N$9))","v":14},{"$f":"VLOOKUP($H13,$N$2:$Z$9,2,FALSE)","v":7.34},{"$f":"VLOOKUP($I13,$N$2:$Z$9,2,FALSE)","v":7.34},{"$f":"IF($G13>0,(K13-J13)/(I13-H13)*($G13-H13)+J13,0)","v":7.34},{"$f":"(1+L13*0.01*$G13/365)","v":1.0018098630136987},{"$f":"365*100*(M13^(1/$G13)-1)","v":7.3341025439399576},{"$f":"100-(N13/$E$9+$E$10)","v":92.861895610876445},{"$f":"L13+$Q$11","v":8.34},{"$f":"(1+P13*0.01*$G13/365)","v":1.0020564383561643},{"$f":"365*100*(Q13^(1/$G13)-1)","v":8.3323873234738564},{"$f":"100-(R13/$E$9+$E$10)","v":92.541018360311966},{"$f":"S13-O13","v":-0.3208772505644788},null,null,null,null,null,null,{"$f":"VLOOKUP(B13,RUONIA_QUOTES!get2.aspx?type_RUONIA_QUOTES,4,FALSE)/100","v":92.85},{"$f":"E9*(100-AA13-E10)","v":7.3711111111111265},null,{"$f":"$AF$9*(A13-$A$13)+$AF$7","v":7.2},{"$f":"100-AD13","v":92.8},{"$f":"($E$6*$AD$13-$E$4*$E$5)/($E$6-$E$4)","v":7.5266666666666646},null,null,{"$f":"MAX(MIN($F13,AI$10)-MIN(MAX($F13,AI$10),MAX(tCur,AI$9,$E13)),0)","v":0},9,0,{"$f":"MAX(MIN($F13,AL$10)-MIN(MAX($F13,AL$10),MAX(tCur,AL$9,$E13)),0)","v":0},9,0,0,9,0,0,0,9,0,0,0,9,0,0]
[2,"RUON-10.18",10,2018,{"$f":"Workday2(DATE(D14,C14,1),-1,65,RUHolidays!$A$1:$A$15)","v":"2018-09-28"},{"$f":"Workday2(DATE(D14,C14+1,1),-1,65,RUHolidays!$A$1:$A$15)","v":"2018-10-31"},{"$f":"F14-$E$1","v":42},{"$f":"MAX(IF($K$3:$K$9<=G14,$K$3:$K$9))","v":30},{"$f":"MIN(IF($N$3:$N$9>G14,$N$3:$N$9))","v":60},{"$f":"VLOOKUP(H14,$N$2:$Z$9,2,FALSE)","v":7.34},{"$f":"VLOOKUP(I14,$N$2:$Z$9,2,FALSE)","v":7.44},{"$f":"IF($G14>0,(K14-J14)/(I14-H14)*($G14-H14)+J14,0)","v":7.38},{"$f":"(1+L14*0.01*$G14/365)/(1+L13*0.01*$G13/365)","v":1.0066701197777392},{"$f":"365*100*(M14^(1/($G14-$G13))-1)","v":7.3538016968209829},{"$f":"100-N14","v":92.64619830317902},{"$f":"L14+$Q$11","v":8.379999999999999},{"$f":"(1+P14*0.01*$G14/365)/(1+P13*0.01*$G13/365)","v":1.007570732624909},{"$f":"365*100*(Q14^(1/($G14-$G13))-1)","v":8.3431040944826904},{"$f":"100-R14","v":91.656895905517302},{"$f":"S14-O14","v":-0.98930239766171724},null,"2018-10-16",{"$f":"N15-N14","v":0.17944579834350272},{"$f":"W14","v":0.17944579834350272},null,null,{"$f":"VLOOKUP(B14,RUONIA_QUOTES!get2.aspx?type_RUONIA_QUOTES,4,FALSE)/100","v":92.62},{"$f":"100-AA14","v":7.3799999999999955},null,7.3145454545454545,92.685454545454547,{"$f":"AD14","v":7.3145454545454545},null,null,0,17,16,0,33,0,0,33,0,0,0,33,0,0,0,33,0,0]
[3,"RUON-11.18",11,2018,{"$f":"Workday2(DATE(D15,C15,1),-1,65,RUHolidays!$A$1:$A$15)","v":"2018-10-31"},{"$f":"Workday2(DATE(D15,C15+1,1),-1,65,RUHolidays!$A$1:$A$15)","v":"2018-11-30"},72,{"$f":"MAX(IF($K$3:$K$9<=G15,$K$3:$K$9))","v":60},{"$f":"MIN(IF($N$3:$N$9>G15,$N$3:$N$9))","v":90},7.44,7.54,7.48,{"$f":"(1+L15*0.01*G15/365)/(1+L14*0.01*G14/365)","v":1.0062102756971212},{"$f":"365*100*(M15^(1/(G15-G14))-1)","v":7.5332474951644857},{"$f":"100-N15","v":92.466752504835512},8.48,{"$f":"(1+P15*0.01*$G15/365)/(1+P14*0.01*$G14/365)","v":1.0070172658387777},{"$f":"365*100*(Q15^(1/($G15-$G14))-1)","v":8.5088489128056786},{"$f":"100-R15","v":91.491151087194325},-0.97560141764118669,null,null,null,null,null,null,{"$f":"VLOOKUP(B15,RUONIA_QUOTES!get2.aspx?type_RUONIA_QUOTES,4,FALSE)/100","v":92.45},7.5499999999999972,null,7.4290909090909096,92.570909090909083,7.4290909090909096,null,null,0,0,30,0,30,0,0,19,11,0,0,30,0,0,0,19,11,0]
[4,"RUON-12.18",12,2018,{"$f":"Workday2(DATE(D16,C16,1),-1,65,RUHolidays!$A$1:$A$15)","v":"2018-11-30"},{"$f":"Workday2(DATE(D16,C16+1,1),-1,65,RUHolidays!$A$1:$A$15)","v":"2018-12-31"},103,{"$f":"MAX(IF($K$3:$K$9<=G16,$K$3:$K$9))","v":90},{"$f":"MIN(IF($N$3:$N$9>G16,$N$3:$N$9))","v":182},7.54,7.86,7.5852173913043481,1.0065531001017411,7.6913860309809623,92.308613969019035,8.5852173913043472,1.0073757278603273,8.6534803730846654,91.346519626915338,-0.96209434210369693,null,"2018-12-14",{"$f":"N17-N15","v":0.32390797913606217},{"$f":"W16+X14","v":0.50335377747956489},null,null,{"$f":"VLOOKUP(B16,RUONIA_QUOTES!get2.aspx?type_RUONIA_QUOTES,4,FALSE)/100","v":92.32},7.6800000000000068,null,7.5436363636363639,92.456363636363633,7.5436363636363639,null,null,0,0,31,0,31,0,0,0,31,0,0,31,0,0,0,0,31,0]
[5,"RUON-1.19",1,2019,{"$f":"Workday2(DATE(D17,C17,1),-1,65,RUHolidays!$A$1:$A$15)","v":"2018-12-31"},{"$f":"Workday2(DATE(D17,C17+1,1),-1,65,RUHolidays!$A$1:$A$15)","v":"2019-01-31"},134,{"$f":"MAX(IF($K$3:$K$9<=G17,$K$3:$K$9))","v":90},{"$f":"MIN(IF($N$3:$N$9>G17,$N$3:$N$9))","v":182},7.54,7.86,7.6930434782608694,1.0066947929965733,7.8571554743005478,92.142844525699445,8.6930434782608685,1.0075055733148364,8.8052700739890142,91.194729926010979,-0.94811459968846634,null,null,null,null,null,null,{"$f":"VLOOKUP(B17,RUONIA_QUOTES!get2.aspx?type_RUONIA_QUOTES,4,FALSE)/100","v":92.19},7.8100000000000023,null,7.6581818181818182,92.341818181818184,7.6581818181818182,null,null,0,0,31,0,28,3,0,0,31,0,0,31,0,0,0,0,31,0]
[6,"RUON-2.19",2,2019,{"$f":"Workday2(DATE(D18,C18,1),-1,65,RUHolidays!$A$1:$A$15)","v":"2019-01-31"},{"$f":"Workday2(DATE(D18,C18+1,1),-1,65,RUHolidays!$A$1:$A$15)","v":"2019-02-28"},162,{"$f":"MAX(IF($K$3:$K$9<=G18,$K$3:$K$9))","v":90},{"$f":"MIN(IF($N$3:$N$9>G18,$N$3:$N$9))","v":182},7.54,7.86,7.7904347826086955,1.0061597991756257,8.0059864111269299,91.994013588873074,8.7904347826086955,1.0068812828414104,8.9406159876386226,91.059384012361377,-0.93462957651169631,null,"2019-02-08",{"$f":"N19-N17","v":0.24085053425637604},{"$f":"W18+X16","v":0.74420431173594093},null,null,{"$f":"VLOOKUP(B18,RUONIA_QUOTES!get2.aspx?type_RUONIA_QUOTES,4,FALSE)/100","v":92.05},7.9500000000000028,null,7.7727272727272734,92.22727272727272,7.7727272727272734,null,null,0,0,28,0,0,28,0,0,28,0,0,4,24,0,0,0,28,0]
[7,"RUON-3.19",3,2019,{"$f":"Workday2(DATE(D19,C19,1),-1,65,RUHolidays!$A$1:$A$15)","v":"2019-02-28"},{"$f":"Workday2(DATE(D19,C19+1,1),-1,65,RUHolidays!$A$1:$A$15)","v":"2019-03-29"},191,{"$f":"MAX(IF($K$3:$K$9<=G19,$K$3:$K$9))","v":182},{"$f":"MIN(IF($N$3:$N$9>G19,$N$3:$N$9))","v":365},7.86,8.34,7.8836065573770497,1.0064540567810882,8.0980060085569239,91.901993991443078,8.8836065573770497,1.0071911732673544,9.0196853937550827,90.980314606244917,-0.92167938519816062,null,"2019-03-22",{"$f":"N20-N19","v":7.0414677743055876E-3},{"$f":"W19+X18","v":0.75124577951024651},null,null,{"$f":"VLOOKUP(B19,RUONIA_QUOTES!get2.aspx?type_RUONIA_QUOTES,4,FALSE)/100","v":91.9},8.0999999999999943,null,7.8872727272727277,92.11272727272727,7.8872727272727277,null,null,0,0,29,0,0,29,0,0,29,0,0,0,29,0,0,0,29,0]
[8,"RUON-4.19",4,2019,{"$f":"Workday2(DATE(D20,C20,1),-1,65,RUHolidays!$A$1:$A$15)","v":"2019-03-29"},{"$f":"Workday2(DATE(D20,C20+1,1),-1,65,RUHolidays!$A$1:$A$15)","v":"2019-04-30"},223,{"$f":"MAX(IF($K$3:$K$9<=G20,$K$3:$K$9))","v":182},{"$f":"MIN(IF($N$3:$N$9>G20,$N$3:$N$9))","v":365},7.86,8.34,7.9675409836065576,1.0071303066631085,8.1050474763312295,91.894952523668763,8.9675409836065576,1.0079324193115811,9.0133311947138139,90.986668805286186,-0.90828371838257738,null,"2019-04-26",{"$f":"N21-N20","v":0.10022503892981227},{"$f":"W20+X19","v":0.85147081844005879},null,null,{"$f":"VLOOKUP(B20,RUONIA_QUOTES!get2.aspx?type_RUONIA_QUOTES,4,FALSE)/100","v":91.75},8.25,null,8.0018181818181819,91.99818181818182,8.0018181818181819,null,null,0,0,17,0,0,32,0,0,32,0,0,0,32,0,0,0,32,0]
{"$rows_left_out":13}
{"sheet":"RUONIA","index":2,"n_rows":1623,"n_cols":14,"rows_kept":1623,"cut":false,"hidden":false,"merged":[]}
["d","r",null,null,"Ставка","Дней","Ставка*Дней"]
["*2018.09.18",724,null,null,{"$f":"VALUE(B2)/100","v":7.24},{"$f":"CurDate-I2","v":1},{"$f":"E2*F2","v":7.24},null,{"$f":"DATE(MID($A2,2,4), MID($A2,7,2), RIGHT($A2,2))","v":"2018-09-18"},{"$f":"E2","v":7.24},7.31,{"$f":"(1+0.01*G2/365)","v":1.0001983561643835},null,{"$f":"K2-J2","v":6.9999999999999396E-2}]
["*2018.09.17",724,null,null,{"$f":"VALUE(B3)/100","v":7.24},{"$f":"I2-I3","v":1},{"$f":"E3*F3","v":7.24},null,{"$f":"DATE(MID($A3,2,4), MID($A3,7,2), RIGHT($A3,2))","v":"2018-09-17"},{"$f":"E3","v":7.24},7.12,{"$f":"(1+0.01*G3/365)","v":1.0001983561643835},null,{"$f":"K3-J3","v":-0.12000000000000011}]
["*2018.09.14",702,null,null,7.02,{"$f":"I3-I4","v":3},{"$f":"E4*F4","v":21.06},null,"2018-09-14",7.02,7.12,1.0005769863013698,null,0.10000000000000053]
["*2018.09.13",700,null,null,7,1,7,null,"2018-09-13",7,7.09,1.0001917808219178,null,8.9999999999999858E-2]
["*2018.09.12",681,null,null,6.81,1,6.81,null,"2018-09-12",6.81,7.1,1.0001865753424657,null,0.29000000000000004]
["*2018.09.11",701,null,null,7.01,1,7.01,null,"2018-09-11",7.01,7.07,1.0001920547945204,null,6.0000000000000497E-2]
["*2018.09.10",698,null,null,6.98,1,6.98,null,"2018-09-10",6.98,7.11,1.0001912328767124,null,0.12999999999999989]
["*2018.09.07",697,null,null,6.97,3,20.91,null,"2018-09-07",6.97,7.09,1.0005728767123288,null,0.12000000000000011]
["*2018.09.06",687,null,null,6.87,1,6.87,null,"2018-09-06",6.87,7.14,1.0001882191780822,null,0.26999999999999957]
["*2018.09.05",700,null,null,7,1,7,null,"2018-09-05",7,7.14,1.0001917808219178,null,0.13999999999999968]
["*2018.09.04",717,null,null,7.17,1,7.17,null,"2018-09-04",7.17,7.05,1.0001964383561643,null,-0.12000000000000011]
["*2018.09.03",715,null,null,7.15,1,7.15,null,"2018-09-03",7.15,7.04,1.0001958904109589,null,-0.11000000000000032]
["*2018.08.31",714,null,null,7.14,3,21.419999999999998,null,"2018-08-31",7.14,7.05,1.0005868493150685,null,-8.9999999999999858E-2]
["*2018.08.30",714,null,null,7.14,1,7.14,null,"2018-08-30",7.14,7.07,1.0001956164383561,null,-6.9999999999999396E-2]
["*2018.08.29",718,null,null,7.18,1,7.18,null,"2018-08-29",7.18,7.18,1.0001967123287672,null,0]
["*2018.08.28",726,null,null,7.26,1,7.26,null,"2018-08-28",7.26,6.93,1.0001989041095891,null,-0.33000000000000007]
["*2018.08.27",722,null,null,7.22,1,7.22,null,"2018-08-27",7.22,6.91,1.000197808219178,null,-0.30999999999999961]
["*2018.08.24",697,null,null,6.97,3,20.91,null,"2018-08-24",6.97,6.94,1.0005728767123288,null,-2.9999999999999361E-2]
["*2018.08.23",673,null,null,6.73,1,6.73,null,"2018-08-23",6.73,6.88,1.0001843835616437,null,0.14999999999999947]
{"$rows_left_out":1604}
{"sheet":"RUHolidays","index":3,"n_rows":15,"n_cols":1,"rows_kept":15,"cut":false,"hidden":false,"merged":[]}
["2015-12-31"]
["2016-01-01"]
["2016-01-02"]
["2016-01-03"]
["2016-01-07"]
["2016-01-08"]
["2016-01-09"]
["2016-01-10"]
["2016-02-23"]
["2016-03-08"]
["2016-05-02"]
["2016-05-03"]
["2016-05-09"]
["2016-06-13"]
["2016-11-04"]

{"sheet":"FloatersQuotes","index":4,"n_rows":21,"n_cols":26,"rows_kept":21,"cut":false,"hidden":false,"merged":[]}
["BondName","Moment","bid","offer","mid","last","price",null,null,null,null,"Bond","SecurityId","bid","offer","last","vol","lastmoment","spread","ytmlast","ytmbid","ytmask","mdur","ytm"]
[24019,null,null,null,null,10034,10034,null,null,null,null,"ОФЗ 26208","SU26208RMFS7",null,null,10012,"1977271,25","19.09.2018 18:48:49",null,733,null,null,41,733,{"$f":"W2/100*365","v":149.64999999999998},{"$f":"X2/100","v":7.33}]
[29008,null,null,null,null,11129,11129,null,null,null,null,"ОФЗ 26216","SU26216RMFS0",null,null,9956,"1925471,06","19.09.2018 18:45:37",null,752,null,null,59,752,{"$f":"W3/100*365","v":215.35},{"$f":"X3/100","v":7.52}]
[29006,null,null,null,null,10420,10420,null,null,null,null,"ОФЗ 26210","SU26210RMFS3",null,null,9918,"2942670,60","19.09.2018 17:48:12",null,764,null,null,109,764,397.85,7.64]
[29009,null,null,null,null,11535,11535,null,null,null,null,"ОФЗ 26214","SU26214RMFS5",null,null,9799,"1170992,45","19.09.2018 18:28:44",null,783,null,null,148,783,{"$f":"W5/100*365","v":540.20000000000005},7.83]
[29011,null,null,null,null,10087,10087,null,null,null,null,"ОФЗ 26205","SU26205RMFS3",null,null,9945,"288576054,00","19.09.2018 17:24:23",null,799,null,null,214,799,781.1,7.99]
[29012,null,null,null,null,10035,10035,null,null,null,null,"ОФЗ 26217","SU26217RMFS8",null,null,9890,"98900000,00","19.09.2018 17:32:04",null,808,null,null,246,808,897.9,8.08]
[24018,null,null,null,null,9998,9998,null,null,null,null,"ОФЗ 25083","SU25083RMFS5",null,null,9724,"1964207,60","19.09.2018 17:57:23",null,814,null,null,268,814,978.2,8.14]
[null,null,null,null,null,null,null,null,null,null,null,"ОФЗ 26209","SU26209RMFS5",null,null,9850,"32505000,00","19.09.2018 18:29:36",null,822,null,null,310,822,1131.5,8.2200000000000006]
[null,null,null,null,null,null,null,null,null,null,null,"ОФЗ 26220","SU26220RMFS2",null,null,9730,"97300000,00","19.09.2018 18:23:08",null,833,null,null,334,833,1219.0999999999999,8.33]
[null,null,null,null,null,null,null,null,null,null,null,"ОФЗ 26211","SU26211RMFS1",null,null,9600,"4799850,00","19.09.2018 16:54:16",null,827,null,null,349,827,1273.8500000000001,8.27]
[null,null,null,null,null,null,null,null,null,null,null,"ОФЗ 26215","SU26215RMFS2",null,null,9551,"5438453,28","19.09.2018 18:05:54",null,829,null,null,388,829,1416.2,8.2899999999999991]
[null,null,null,null,null,null,null,null,null,null,null,"ОФЗ 26223","SU26223RMFS6",null,null,9235,"166230000,00","19.09.2018 18:35:31",null,844,null,null,426,844,1554.8999999999999,8.44]
[null,null,null,null,null,null,null,null,null,null,null,"ОФЗ 26222","SU26222RMFS8",null,null,9420,"188395000,00","19.09.2018 18:23:11",null,851,null,null,448,851,1635.2,8.51]
[null,null,null,null,null,null,null,null,null,null,null,"ОФЗ 26219","SU26219RMFS4",null,null,9545,"159401500,00","19.09.2018 18:39:13",null,873,null,null,536,873,1956.4,8.73]
[null,null,null,null,null,null,null,null,null,null,null,"ОФЗ 26207","SU26207RMFS9",null,null,9780,"4884032,12","19.09.2018 18:05:21",null,870,null,null,566,870,2065.9,8.6999999999999993]
[null,null,null,null,null,null,null,null,null,null,null,"ОФЗ 26212","SU26212RMFS9",null,null,9015,"5409000,00","19.09.2018 18:54:47",null,879,null,null,624,879,2277.6,8.7899999999999991]
[null,null,null,null,null,null,null,null,null,null,null,"ОФЗ 26224","SU26224RMFS4",null,null,8815,"44075000,00","19.09.2018 18:15:48",null,880,null,null,675,880,{"$f":"W21/100*365","v":3018.5499999999997},{"$f":"X21/100","v":8.75}]
[null,null,null,null,null,null,null,null,null,null,null,"ОФЗ 26218","SU26218RMFS6",null,null,9931,"5622762,34","19.09.2018 18:39:16",null,877,null,null,716,877]
[null,null,null,null,null,null,null,null,null,null,null,"ОФЗ 26221","SU26221RMFS0",null,null,9280,"92797216,00","19.09.2018 18:27:49",null,876,null,null,777,876]
{"$rows_left_out":2}
{"sheet":"Roisfix_data","index":5,"n_rows":63,"n_cols":8,"rows_kept":63,"cut":false,"hidden":false,"merged":[]}
["НАЦИОНАЛЬНАЯ ФИНАНСОВАЯ АССОЦИАЦИЯ"]
["Телефон: +7 495 980-98-74"]
["Почта: info@nfa.ru"]
["Адрес: 107045, г. Москва, Большой Сергиевский переулок, д. 10, подъезд 2, этаж 3"]
["English"]
["Начало"]
["Документы"]
["Контрибьютеры"]
["Экспертный совет"]
["Новости"]
["Архив"]
["ROISFIX®"]
["19.09.2018"]
[]
["Roisfix1W - 7,34"]
[]
["Roisfix2W - 7,34"]
[]
["Roisfix1M - 7,34"]
[]
{"$rows_left_out":44}
{"sheet":"Roisfix_clean","index":6,"n_rows":8,"n_cols":3,"rows_kept":8,"cut":false,"hidden":false,"merged":[]}
["Term","Value"]
[7,{"$f":"Roisfix_data!A15","v":"Roisfix1W - 7,34"},{"$f":"SUBSTITUTE(RIGHT(B2,LEN(B2)-SEARCH(\"-\",B2)),\",\",\"\")/100","v":7.34}]
[14,{"$f":"Roisfix_data!A17","v":"Roisfix2W - 7,34"},{"$f":"SUBSTITUTE(RIGHT(B3,LEN(B3)-SEARCH(\"-\",B3)),\",\",\"\")/100","v":7.34}]
[30,{"$f":"Roisfix_data!A19","v":"Roisfix1M - 7,34"},7.34]
[60,{"$f":"Roisfix_data!A21","v":"Roisfix2M - 7,44"},7.44]
[90,{"$f":"Roisfix_data!A23","v":"Roisfix3M - 7,54"},7.54]
[182,{"$f":"Roisfix_data!A25","v":"Roisfix6M - 7,86"},7.86]
[365,{"$f":"Roisfix_data!A27","v":"Roisfix1Y - 8,34"},8.34]

{"sheet":"RUONIA_QUOTES","index":7,"n_rows":13,"n_cols":4,"rows_kept":13,"cut":false,"hidden":false,"merged":[]}
["issue_name","BID","ASK","MID"]
["RUON-9.18",9273,9298,9285]
["RUON-10.18",9250,9275,9262]
["RUON-11.18",9233,9258,9245]
["RUON-12.18",9220,9245,9232]
["RUON-1.19",9207,9232,9219]
["RUON-2.19",9190,9220,9205]
["RUON-3.19",9175,9205,9190]
["RUON-4.19",9160,9190,9175]
["RUON-5.19",9145,9175,9160]
["RUON-6.19",9140,9170,9155]
["RUON-7.19",9140,9170,9155]
["RUON-8.19",9140,9170,9155]