{"text_format":"1","workbook":"xlsx","n_sheets":4,"sheets":["FutInfo","MD","PortHedge","TempPort"],"not_rendered":{"charts":2,"images":0,"macros":1,"external_links":1,"defined_names":36,"comments":0,"pivot_tables":0},"unopened":[],"bounds":{"document_bytes":16777216,"sheet_cells":100000,"rows_first":2000,"rows_last":500,"rows_between":2000,"halvings":0,"cell_chars":16384,"cell_head_chars":4096},"cells_cut":0,"cells_raw":0,"read":"whole","date_system":"1900"}

{"sheet":"FutInfo","index":0,"n_rows":6,"n_cols":13,"rows_kept":6,"cut":false,"hidden":false,"merged":[]}
["TRADEDATE","TICKER","EXPDATE","CTDBOND","BondPrice","AI","FutPrcie","CF","Yld","Dur","Bond_DVO1","FutDVO1","IM"]
["2021-12-14","OFZ2-3.22","2022-03-05","ОФЗ 26222",96.26,1.07,9800,0.98260000000000003,8.74,2.6358640341949902,-0.23,-2.34,470]
["2021-12-14","OFZ4-3.22","2022-03-05","ОФЗ 26234",87.61,1.8,10129,0.86960000000000004,8.7200000000000006,3.7603495860165599,-0.26,-3.04,588]
["2021-12-14","OFZ6-3.22","2022-03-05","ОФЗ 26219",96.997,1.762,10807,0.89580000000000004,8.6999999999999993,4.4541192230408599,-0.36,-3.98,736]
["2021-12-14","OF10-3.22","2022-03-05","ОФЗ 26235",84,1.3420000000000001,9014,0.93489999999999995,8.6199999999999992,7.41255749277998,-0.54,-5.74,705]
["2021-12-14","OF15-3.22","2022-03-05","ОФЗ 26233",81.75,2.206,9310,0.87870000000000004,8.56,9.9009900990098991,-0.66,-7.48,1009]

{"sheet":"MD","index":1,"n_rows":1379,"n_cols":20,"rows_kept":1379,"cut":false,"hidden":false,"merged":[]}
["ISIN","SHORTNAME","FIRM_SHORT_NAME","ADMITTEDQUOTE","MARKETPRICE2","CLOSEPRICE","PRICE","YIELD","DURATION","MD","DVO1","ACCINT","ISSUERID","SECURITYID","BUYBACKDATE","MATDATE","MATURITY","FACEVALUE","MARKETPRICE3","INN"]
["RU000A0ZZYF7","АС ФИН1Р1","\"АС ФИНАНС\"",10000,10000,10000,10000,833,9616,8876,-908,2381,"MC0461600000","RU000A0ZZYF7","2022-11-27","2023-11-22","2022-11-27",100000,10000,"6672144910*"]
["RU000A0JVUB7","ПропфинБО1","01 Пропертиз",9700,9881,9700,9700,4828,1150,776,-79,4986,"MC0363000000","RU000A0JVUB7",null,"2024-09-27","2024-09-27",100000,9878,"7722696870*"]
["RU000A0JXRB9","ПропфнБ-П2","01 Пропертиз",9700,10153,9700,9700,0,47698,47698,null,0,"MC0363000000","RU000A0JXRB9",null,"2024-05-14","2024-05-14",100000,10168,"7722696870*"]
["RU000A0JXC40","ПропфнБ-П1","01 Пропертиз",8150,10305,10000,10000,0,63315,63315,null,0,"MC0363000000","RU000A0JXC40",null,"2026-01-23","2026-01-23",100000,10372,"7722696870*"]
["XS2183144810","ALFA-23 EU","Alfa Holding",10194,0,10194,10194,177,21369,20998,-2185,2123,"MC0395300000","XS2183144810",null,"2023-06-11","2023-06-11",100000,0,"0000003953*"]
["XS2045847295","BCSALORLV1","BCS SP Plc",9517,8954,9950,9950,0,21753,21753,null,0,"MC0410800000","XS2045847295",null,"2022-11-15","2022-11-15",7500000,9029,"0010035220*"]
["XS2049809341","BCS10/22-2","BCS SP Plc",10488,10284,10488,10488,0,21808,21808,null,0,"MC0410800000","XS2049809341",null,"2022-10-17","2022-10-17",10000000,10366,"0010035220*"]
["XS2020622887","BCS08/22","BCS SP Plc",9090,10000,9090,9090,0,22438,22438,null,0,"MC0410800000","XS2020622887",null,"2022-08-01","2022-08-01",10000000,10030,"0010035220*"]
["XS2123084639","BCSALORLV2","BCS SP Plc",10000,10000,10000,10000,0,25698,25698,null,0,"MC0410800000","XS2123084639",null,"2023-05-15","2023-05-15",7500000,10000,"0010035220*"]
["XS2139835636","BCSALORPT","BCS SP Plc",10000,0,10000,10000,0,26630,26630,null,0,"MC0410800000","XS2139835636",null,"2023-06-15","2023-06-15",10000000,0,"0010035220*"]
["XS1985081444","BCS 05/24","BCS SP Plc",8900,9117,8900,8900,0,27369,27369,null,0,"MC0410800000","XS1985081444",null,"2024-05-24","2024-05-24",10000000,9165,"0010035220*"]
["XS1943597994","BCS12/23-3","BCS SP Plc",10000,10082,10000,10000,0,28219,28219,null,0,"MC0410800000","XS1943597994",null,"2023-12-20","2023-12-20",10000000,10072,"0010035220*"]
["XS2118272389","BCS06/23","BCS SP Plc",10399,10223,10399,10399,0,29917,29917,null,0,"MC0410800000","XS2118272389",null,"2023-06-13","2023-06-13",10000000,10244,"0010035220*"]
["XS2028880115","BCS06/24-7","BCS SP Plc",9943,9988,9920,9920,0,31698,31698,null,0,"MC0410800000","XS2028880115",null,"2024-06-30","2024-06-30",10000000,9988,"0010035220*"]
["XS2072914125","BCS12/24-4","BCS SP Plc",10150,10005,10150,10150,0,33369,33369,null,0,"MC0410800000","XS2072914125",null,"2024-12-30","2024-12-30",10000000,10344,"0010035220*"]
["XS2058684619","BCS12/24-2","BCS SP Plc",10140,10065,10140,10140,0,33753,33753,null,0,"MC0410800000","XS2058684619",null,"2024-12-30","2024-12-30",10000000,10062,"0010035220*"]
["XS2091672803","BCS12/24-D","BCS SP Plc",10050,9967,10100,10100,0,34520,34520,null,0,"MC0410800000","XS2091672803",null,"2024-12-30","2024-12-30",10000000,10007,"0010035220*"]
["XS2091667043","BCS12/24-B","BCS SP Plc",9700,7943,9400,9400,0,35232,35232,null,0,"MC0410800000","XS2091667043",null,"2024-12-30","2024-12-30",10000000,9511,"0010035220*"]
["XS2143253495","BCS06/25-4","BCS SP Plc",10040,9973,10050,10050,0,38986,38986,null,0,"MC0410800000","XS2143253495",null,"2025-06-30","2025-06-30",10000000,9973,"0010035220*"]
["XS2125163688","BCS06/25-2","BCS SP Plc",10498,9999,10000,10000,0,39068,39068,null,0,"MC0410800000","XS2125163688",null,"2025-06-26","2025-06-26",10000000,10019,"0010035220*"]
["XS2181436796","BCS06/25-5","BCS SP Plc",10410,10410,10410,10410,0,39972,39972,null,0,"MC0410800000","XS2181436796",null,"2025-06-30","2025-06-30",10000000,10410,"0010035220*"]
["XS2185963803","BCS10/25","BCS SP Plc",10000,10000,10000,10000,0,53260,53260,null,0,"MC0410800000","XS2185963803",null,"2025-10-15","2025-10-15",10000000,10000,"0010035220*"]
["XS1759801720","CBOM-23","CBOM Finance",10550,10539,10550,10550,290,20575,19995,-2144,1757,"MC0383800000","XS1759801720",null,"2023-02-14","2023-02-14",100000,10502,"0000425241*"]
["XS1951067039","CBOM-24 EU","CBOM Finance",10599,10599,10599,10599,292,27698,26912,-2865,466,"MC0383800000","XS1951067039",null,"2024-02-20","2024-02-20",100000,10590,"0000425241*"]
["XS1964558339","CBOM-24","CBOM Finance",10937,10979,10937,10937,398,29315,28192,-3133,1780,"MC0383800000","XS1964558339",null,"2024-06-25","2024-06-25",100000,10977,"0000425241*"]
["XS2099763075","CBOM-25","CBOM Finance",10290,10291,10290,10290,385,35506,34190,-3543,731,"MC0383800000","XS2099763075",null,"2025-01-29","2025-01-29",100000,10299,"0000425241*"]
["XS1533915721","EVR-23","EVRAZ plc",10648,10664,10762,10762,215,19123,18720,-2016,75,"MC0471100000","XS1533915721",null,"2023-03-20","2023-03-20",100000,10663,"00007784342*"]
["XS1843443273","EVR-24","EVRAZ plc",10850,10803,10850,10850,229,27808,27185,-3018,2523,"MC0471100000","XS1843443273",null,"2024-04-02","2024-04-02",100000,10802,"00007784342*"]
["XS1961080501","EUCH-24","EuroChem Fin",11020,11009,11020,11020,220,30027,29381,-3277,1344,"MC0439700000","XS1961080501",null,"2024-03-13","2024-03-13",100000,11009,"0000004397*"]
{"$rows_left_out":1350}
{"sheet":"PortHedge","index":2,"n_rows":36,"n_cols":30,"rows_kept":36,"cut":false,"hidden":false,"merged":[[0,4,0,7],[12,7,14,7],[12,8,14,8]]}
[null,null,null,null,"Изменение дюрации портфеля облигаций"]
["Дата",{"$f":"TODAY()","v":"2021-12-15"},null,null,null,null,null,null,null,null,null,null,null,null,"ADMITTEDQOUTE",{"$f":"MATCH(O2,MD!$1:$1,0)","v":{"$error":"#N/A"}}]
[null,null,null,null,null,null,null,null,null,null,null,null,null,null,"MARKETPRICE2",{"$f":"MATCH(O3,MD!$1:$1,0)","v":5}]
[null,"Стоимость, млн","DV01 Long, руб/бп","DV01 Short","DV01, Портфель","DV01, фьючерсы","DV01,свопы","DV01, Портфель + фьючерсы/свопы","Изменение дюрации портфеля, %","Риск ставки, бп","P&L, руб","Дюрация портфеля, лет","Дюрация портфель+фьючерсы/свопы, лет",null,"MARKETPRICE3",{"$f":"MATCH(O4,MD!$1:$1,0)","v":19}]
["Всего",{"$f":"SUM(B6:B11)","v":1784.2895000000001},{"$f":"SUM(C6:C11)","v":-351220},{"$f":"SUM(D6:D11)","v":0},{"$f":"C5+D5","v":-351220},{"$f":"SUM(F6:F11)","v":384014.42118695372},{"$f":"SUM(G6:G11)","v":100498.62180749558},{"$f":"E5+F5+G5","v":133293.04299444932},{"$f":"IF(ABS(E5)>0,(H5-E5)/E5,0)","v":-1.379514386978103},null,{"$f":"SUM(K6:K11)","v":-20583294.145703711},{"$f":"SUMPRODUCT(B20:B289,J20:J289,R20:R289)/SUMPRODUCT(B20:B289,R20:R289)","v":2.0138858246623341},{"$f":"(SUMPRODUCT(B20:B289,J20:J289,R20:R289)+SUMPRODUCT(U20:U24,AC20:AC24,AD20:AD24))/SUMPRODUCT(B20:B289,R20:R289)","v":-0.24183305834551802},null,"CLOSEPRICE",{"$f":"MATCH(O5,MD!$1:$1,0)","v":6}]
["< 1 года",{"$f":"SUMIF($G$20:INDEX($G:$G,ROWS($G:$G)),\"=1\",$I$20:INDEX($I:$I,ROWS($I:$I)))","v":649.59},{"$f":"SUMIF($G$20:INDEX($G:$G,ROWS($G:$G)),\"=1\",$O$20:INDEX($O:$O,ROWS($O:$O)))","v":-84060},{"$f":"SUMIF($G$20:INDEX($G:$G,ROWS($G:$G)),\"=1\",$P$20:INDEX($P:$P,ROWS($P:$P)))","v":0},-84060,0,{"$f":"U29*Y29","v":4579.4392523364531},{"$f":"E6+F6+G6","v":-79480.560747663549},-5.4478220941428165E-2,-50,{"$f":"H6*J6","v":3974028.0373831773},null,null,null,"PRICE",{"$f":"MATCH(O6,MD!$1:$1,0)","v":7}]
["1-3 года",{"$f":"SUMIF($G$20:INDEX($G:$G,ROWS($G:$G)),\"=3\",$I$20:INDEX($I:$I,ROWS($I:$I)))","v":923.14949999999999},{"$f":"SUMIF($G$20:INDEX($G:$G,ROWS($G:$G)),\"=3\",$O$20:INDEX($O:$O,ROWS($O:$O)))","v":-187800},{"$f":"SUMIF($G$20:INDEX($G:$G,ROWS($G:$G)),\"=3\",$P$20:INDEX($P:$P,ROWS($P:$P)))","v":0},-187800,{"$f":"U20*Z20","v":38064.08151842052},{"$f":"U30*Y30","v":37625.616013819053},{"$f":"E7+F7+G7","v":-112110.30246776043},-0.40303353318551421,-50,5605515.1233880213]
["3-5 лет",{"$f":"SUMIF($G$20:INDEX($G:$G,ROWS($G:$G)),\"=5\",$I$20:INDEX($I:$I,ROWS($I:$I)))","v":211.55},{"$f":"SUMIF($G$20:INDEX($G:$G,ROWS($G:$G)),\"=5\",$O$20:INDEX($O:$O,ROWS($O:$O)))","v":-79360},{"$f":"SUMIF($G$20:INDEX($G:$G,ROWS($G:$G)),\"=5\",$P$20:INDEX($P:$P,ROWS($P:$P)))","v":0},-79360,{"$f":"U21*Z21","v":69088.828771849119},{"$f":"U31*Y31","v":58293.566541340078},{"$f":"E8+F8+G8","v":48022.395313189198},-1.6051209086843397,-50,-2401119.7656594599,null,null,null,"CURRENT METH",{"$f":"MATCH(I17,MD!$1:$1,0)","v":5}]
["5-7 лет",{"$f":"SUMIF($G$20:INDEX($G:$G,ROWS($G:$G)),\"=7\",$I$20:INDEX($I:$I,ROWS($I:$I)))","v":0},{"$f":"SUMIF($G$20:INDEX($G:$G,ROWS($G:$G)),\"=7\",$O$20:INDEX($O:$O,ROWS($O:$O)))","v":0},{"$f":"SUMIF($G$20:INDEX($G:$G,ROWS($G:$G)),\"=7\",$P$20:INDEX($P:$P,ROWS($P:$P)))","v":0},0,185581.89327974996,null,185581.89327974996,0,-125,-23197736.659968745]
["7-10 лет",{"$f":"SUMIF($G$20:INDEX($G:$G,ROWS($G:$G)),\"=10\",$I$20:INDEX($I:$I,ROWS($I:$I)))","v":0},{"$f":"SUMIF($G$20:INDEX($G:$G,ROWS($G:$G)),\"=10\",$O$20:INDEX($O:$O,ROWS($O:$O)))","v":0},{"$f":"SUMIF($G$20:INDEX($G:$G,ROWS($G:$G)),\"=10\",$P$20:INDEX($P:$P,ROWS($P:$P)))","v":0},0,0,null,0,0,-50,0]
["10-15 лет",{"$f":"SUMIF($G$20:INDEX($G:$G,ROWS($G:$G)),\"=15\",$I$20:INDEX($I:$I,ROWS($I:$I)))","v":0},{"$f":"SUMIF($G$20:INDEX($G:$G,ROWS($G:$G)),\"=15\",$O$20:INDEX($O:$O,ROWS($O:$O)))","v":0},{"$f":"SUMIF($G$20:INDEX($G:$G,ROWS($G:$G)),\"=15\",$P$20:INDEX($P:$P,ROWS($P:$P)))","v":0},0,91279.617616934105,null,91279.617616934105,0,-50,-4563980.8808467053]
[null,null,null,null,null,null,null,null,null,null,null,null,50]
[null,null,null,null,null,null,null,"Желаемое изменение дюрации (DVO1)",{"$f":"(M12-100)*0.01","v":-0.5},null,null,null,"Доля свопов"]
[null,null,null,null,null,null,null,null,null,null,null,null,50]
[{"$f":"IF(SUM($N$20:INDEX($N:$N,ROWS($N:$N)))>0,\"ВНИМАНИЕ! Обнаружено \"&SUM($N$20:INDEX($N:$N,ROWS($N:$N)))&\" строк с неправильными данными\",\"\")","v":""}]
[]
["Рублевые облигации",null,null,null,null,null,null,null,"MARKETPRICE2",null,null,null,null,null,null,null,null,null,null,"Фьючерсы ОФЗ"]
["ISIN","Количество","Выпуск","Эмитент","Погашение/Оферта","Лет до погашения","Группа по срокам","YTM","Стоимость поз, млн руб","Дюрация, лет","MD","DV01","DV01 Total","Ошибка","DVLong","DVShort","Notional","Pdirty",null,"Контракт","Свое количество фьючерсов","Расчетное количество фьючерсов","CTD","CF CTD","DV short","DV01","DV total","DV long","Дюрация","Цена"]
[null,null,{"$f":"VLOOKUP(A19,MD!A:C,2,FALSE)","v":{"$error":"#N/A"}},{"$f":"VLOOKUP(A19,MD!A:C,3,FALSE)","v":{"$error":"#N/A"}},{"$f":"VLOOKUP(A19,MD!A:R,17,FALSE)","v":{"$error":"#N/A"}},{"$f":"(E19-$B$2)/365","v":{"$error":"#N/A"}},{"$f":"IF(N19=1,0,IF(F19<1,1,IF(F19<3,3,IF(F19<5,5,IF(F19<7,7,IF(F19<10,10,15))))))","v":0},{"$f":"VLOOKUP(A19,MD!A:H,8,FALSE)/100","v":{"$error":"#N/A"}},{"$f":"(VLOOKUP(A19,MD!A:T,$P$8,FALSE)*Q19/10000)*B19/1000000","v":{"$error":"#N/A"}},{"$f":"VLOOKUP(A19,MD!A:I,9,FALSE)/10000","v":{"$error":"#N/A"}},{"$f":"VLOOKUP(A19,MD!A:J,10,FALSE)/10000","v":{"$error":"#N/A"}},{"$f":"VLOOKUP(A19,MD!A:K,11,FALSE)/10000","v":{"$error":"#N/A"}},{"$f":"L19*B19","v":{"$error":"#N/A"}},{"$f":"IF(OR(ISERROR(C19),ISERROR(L19),ISERROR(M19),ISERROR(H19),ISERROR(I19),ISERROR(Q19)),1,0)","v":1},{"$f":"IF(M19<0,M19,0)","v":{"$error":"#N/A"}},{"$f":"IF(M19>0,M19,0)","v":{"$error":"#N/A"}},{"$f":"VLOOKUP(A19,MD!A:R,18,FALSE)/100","v":{"$error":"#N/A"}},{"$f":"VLOOKUP(A19,MD!A:G,7,FALSE)/10+VLOOKUP(A19,MD!A:L,12,FALSE)/100","v":{"$error":"#N/A"}},null,null,null,null,null,null,{"$f":"IF(AA19>0,AA19,0)","v":38064.08151842052},null,{"$f":"Z20*U20","v":38064.08151842052},{"$f":"IF(AA19<0,AA19,0)","v":0}]
["RU000A0ZYDD9",100000,{"$f":"VLOOKUP(A20,MD!A:C,2,FALSE)","v":"ТрнфБО1P8"},{"$f":"VLOOKUP(A20,MD!A:C,3,FALSE)","v":"Транснефть_"},{"$f":"VLOOKUP(A20,MD!A:R,17,FALSE)","v":"2025-10-09"},{"$f":"(E20-$B$2)/365","v":3.8191780821917809},{"$f":"IF(N20=1,0,IF(F20<1,1,IF(F20<3,3,IF(F20<5,5,IF(F20<7,7,IF(F20<10,10,15))))))","v":5},{"$f":"VLOOKUP(A20,MD!A:H,8,FALSE)/100","v":7.09},{"$f":"(VLOOKUP(A20,MD!A:T,$P$8,FALSE)*Q20/10000)*B20/1000000","v":102.75999999999999},{"$f":"VLOOKUP(A20,MD!A:I,9,FALSE)/10000","v":3.7890000000000001},{"$f":"VLOOKUP(A20,MD!A:J,10,FALSE)/10000","v":3.5381},{"$f":"VLOOKUP(A20,MD!A:K,11,FALSE)/10000","v":-0.37869999999999998},{"$f":"L20*B20","v":-37870},{"$f":"IF(OR(ISERROR(C20),ISERROR(L20),ISERROR(M20),ISERROR(H20),ISERROR(I20),ISERROR(Q20)),1,0)","v":0},{"$f":"IF(M20<0,M20,0)","v":-37870},{"$f":"IF(M20>0,M20,0)","v":0},{"$f":"VLOOKUP(A20,MD!A:R,18,FALSE)/100","v":1000},{"$f":"VLOOKUP(A20,MD!A:G,7,FALSE)/10+VLOOKUP(A20,MD!A:L,12,FALSE)/100","v":1070.3499999999999},null,{"$f":"FutInfo!B2","v":"OFZ2-3.22"},-16024.75,{"$f":"ROUND(E7/Z20,0)*$I$13*(100-$M$14)/100","v":-19765.75},{"$f":"FutInfo!D2","v":"ОФЗ 26222"},{"$f":"FutInfo!H2","v":0.98260000000000003},38064.08151842052,{"$f":"INDEX(MD!K:K,MATCH(W20,MD!B:B, 0))/X20*10/10000","v":-2.375330755139426},{"$f":"Z20*U20","v":38064.08151842052},0,{"$f":"FutInfo!J2","v":2.6358640341949902},{"$f":"FutInfo!G2","v":9800}]
["RU000A0JXZB2",100000,{"$f":"VLOOKUP(A21,MD!A:C,2,FALSE)","v":"РЖД Б01P4R"},{"$f":"VLOOKUP(A21,MD!A:C,3,FALSE)","v":"ОАО \"РЖД\""},{"$f":"VLOOKUP(A21,MD!A:R,17,FALSE)","v":"2025-08-07"},3.6465753424657534,5,{"$f":"VLOOKUP(A21,MD!A:H,8,FALSE)/100","v":5.9},{"$f":"(VLOOKUP(A21,MD!A:T,$P$8,FALSE)*Q21/10000)*B21/1000000","v":108.79000000000002},{"$f":"VLOOKUP(A21,MD!A:I,9,FALSE)/10000","v":3.9068000000000001},{"$f":"VLOOKUP(A21,MD!A:J,10,FALSE)/10000","v":3.6890999999999998},{"$f":"VLOOKUP(A21,MD!A:K,11,FALSE)/10000","v":-0.41489999999999999},-41490,0,-41490,0,{"$f":"VLOOKUP(A21,MD!A:R,18,FALSE)/100","v":1000},{"$f":"VLOOKUP(A21,MD!A:G,7,FALSE)/10+VLOOKUP(A21,MD!A:L,12,FALSE)/100","v":1124.9000000000001},null,{"$f":"FutInfo!B3","v":"OFZ4-3.22"},-22235.25,{"$f":"ROUND(E8/Z21,0)*$I$13*(100-$M$14)/100","v":-6385.25},{"$f":"FutInfo!D3","v":"ОФЗ 26234"},{"$f":"FutInfo!H3","v":0.86960000000000004},69088.828771849119,{"$f":"INDEX(MD!K:K,MATCH(W21,MD!B:B, 0))/X21*10/10000","v":-3.1071757129714808},{"$f":"Z21*U21","v":69088.828771849119},0,{"$f":"FutInfo!J3","v":3.7603495860165599},{"$f":"FutInfo!G3","v":10129}]
["RU000A0ZYFB8",100000,{"$f":"VLOOKUP(A22,MD!A:C,2,FALSE)","v":"КрасЯрКр14"},{"$f":"VLOOKUP(A22,MD!A:C,3,FALSE)","v":"минфин края"},{"$f":"VLOOKUP(A22,MD!A:R,17,FALSE)","v":"2024-10-31"},2.8794520547945206,3,{"$f":"VLOOKUP(A22,MD!A:H,8,FALSE)/100","v":6.13},{"$f":"(VLOOKUP(A22,MD!A:T,$P$8,FALSE)*Q22/10000)*B22/1000000","v":105.78},{"$f":"VLOOKUP(A22,MD!A:I,9,FALSE)/10000","v":2.8},{"$f":"VLOOKUP(A22,MD!A:J,10,FALSE)/10000","v":2.6381999999999999},{"$f":"VLOOKUP(A22,MD!A:K,11,FALSE)/10000","v":-0.27960000000000002},-27960,0,-27960,0,{"$f":"VLOOKUP(A22,MD!A:R,18,FALSE)/100","v":1000},{"$f":"VLOOKUP(A22,MD!A:G,7,FALSE)/10+VLOOKUP(A22,MD!A:L,12,FALSE)/100","v":1059.82},null,{"$f":"FutInfo!B4","v":"OFZ6-3.22"},-45671.5,{"$f":"ROUND(E9/Z22,0)*$I$13","v":0},{"$f":"FutInfo!D4","v":"ОФЗ 26219"},{"$f":"FutInfo!H4","v":0.89580000000000004},185581.89327974996,{"$f":"INDEX(MD!K:K,MATCH(W22,MD!B:B, 0))/X22*10/10000","v":-4.0634070104934139},{"$f":"Z22*U22","v":185581.89327974996},0,{"$f":"FutInfo!J4","v":4.4541192230408599},{"$f":"FutInfo!G4","v":10807}]
["RU000A0ZYCM2",100000,{"$f":"VLOOKUP(A23,MD!A:C,2,FALSE)","v":"КрасЯрКр13"},{"$f":"VLOOKUP(A23,MD!A:C,3,FALSE)","v":"минфин края"},{"$f":"VLOOKUP(A23,MD!A:R,17,FALSE)","v":"2024-10-03"},2.8027397260273972,3,{"$f":"VLOOKUP(A23,MD!A:H,8,FALSE)/100","v":6.07},{"$f":"(VLOOKUP(A23,MD!A:T,$P$8,FALSE)*Q23/10000)*B23/1000000","v":105.90999999999998},{"$f":"VLOOKUP(A23,MD!A:I,9,FALSE)/10000","v":2.7204999999999999},{"$f":"VLOOKUP(A23,MD!A:J,10,FALSE)/10000","v":2.5648},{"$f":"VLOOKUP(A23,MD!A:K,11,FALSE)/10000","v":-0.27350000000000002},-27350.000000000004,0,-27350.000000000004,0,{"$f":"VLOOKUP(A23,MD!A:R,18,FALSE)/100","v":1000},{"$f":"VLOOKUP(A23,MD!A:G,7,FALSE)/10+VLOOKUP(A23,MD!A:L,12,FALSE)/100","v":1066.45},null,{"$f":"FutInfo!B5","v":"OF10-3.22"},0,{"$f":"IF(M14<100,ROUND(E10/Z23,0)*$I$13,0)","v":0},{"$f":"FutInfo!D5","v":"ОФЗ 26235"},{"$f":"FutInfo!H5","v":0.93489999999999995},0,{"$f":"INDEX(MD!K:K,MATCH(W23,MD!B:B, 0))/X23*10/10000","v":-5.8530324098834097},{"$f":"Z23*U23","v":0},0,{"$f":"FutInfo!J5","v":7.41255749277998},{"$f":"FutInfo!G5","v":9014}]
["RU000A0ZYB40",100000,{"$f":"VLOOKUP(A24,MD!A:C,2,FALSE)","v":"МФКузбас17"},{"$f":"VLOOKUP(A24,MD!A:C,3,FALSE)","v":"МинфинКузбаc"},{"$f":"VLOOKUP(A24,MD!A:R,17,FALSE)","v":"2024-09-26"},2.7835616438356166,3,{"$f":"VLOOKUP(A24,MD!A:H,8,FALSE)/100","v":5.68},{"$f":"(VLOOKUP(A24,MD!A:T,$P$8,FALSE)*Q24/10000)*B24/1000000","v":78.855000000000004},{"$f":"VLOOKUP(A24,MD!A:I,9,FALSE)/10000","v":2.0575000000000001},{"$f":"VLOOKUP(A24,MD!A:J,10,FALSE)/10000","v":1.9469000000000001},{"$f":"VLOOKUP(A24,MD!A:K,11,FALSE)/10000","v":-0.1575},-15750,0,-15750,0,{"$f":"VLOOKUP(A24,MD!A:R,18,FALSE)/100","v":750},{"$f":"VLOOKUP(A24,MD!A:G,7,FALSE)/10+VLOOKUP(A24,MD!A:L,12,FALSE)/100","v":1072.97},null,{"$f":"FutInfo!B6","v":"OF15-3.22"},-11865,{"$f":"IF(M14<100,ROUND(E11/Z24,0)*$I$13,0)","v":0},{"$f":"FutInfo!D6","v":"ОФЗ 26233"},{"$f":"FutInfo!H6","v":0.87870000000000004},91279.617616934105,{"$f":"INDEX(MD!K:K,MATCH(W24,MD!B:B, 0))/X24*10/10000","v":-7.6931831114145899},{"$f":"Z24*U24","v":91279.617616934105},0,{"$f":"FutInfo!J6","v":9.9009900990098991},{"$f":"FutInfo!G6","v":9310}]
["RU000A0JXYS9",100000,{"$f":"VLOOKUP(A25,MD!A:C,2,FALSE)","v":"КраснодКр1"},{"$f":"VLOOKUP(A25,MD!A:C,3,FALSE)","v":"ДФБККраснКр"},{"$f":"VLOOKUP(A25,MD!A:R,17,FALSE)","v":"2024-08-09"},2.6520547945205482,3,{"$f":"VLOOKUP(A25,MD!A:H,8,FALSE)/100","v":7.01},{"$f":"(VLOOKUP(A25,MD!A:T,$P$8,FALSE)*Q25/10000)*B25/1000000","v":104.03},{"$f":"VLOOKUP(A25,MD!A:I,9,FALSE)/10000","v":2.2328000000000001},{"$f":"VLOOKUP(A25,MD!A:J,10,FALSE)/10000","v":2.0865999999999998},{"$f":"VLOOKUP(A25,MD!A:K,11,FALSE)/10000","v":-0.21890000000000001},-21890,0,-21890,0,{"$f":"VLOOKUP(A25,MD!A:R,18,FALSE)/100","v":1000},{"$f":"VLOOKUP(A25,MD!A:G,7,FALSE)/10+VLOOKUP(A25,MD!A:L,12,FALSE)/100","v":1049.1600000000001}]
["RU000A0JXTW1",300000,{"$f":"VLOOKUP(A26,MD!A:C,2,FALSE)","v":"БелгОб2017"},{"$f":"VLOOKUP(A26,MD!A:C,3,FALSE)","v":"ПравБелгорОб"},{"$f":"VLOOKUP(A26,MD!A:R,17,FALSE)","v":"2024-06-11"},2.4904109589041097,3,{"$f":"VLOOKUP(A26,MD!A:H,8,FALSE)/100","v":6.72},{"$f":"(VLOOKUP(A26,MD!A:T,$P$8,FALSE)*Q26/10000)*B26/1000000","v":263.36399999999998},{"$f":"VLOOKUP(A26,MD!A:I,9,FALSE)/10000","v":1.7863},{"$f":"VLOOKUP(A26,MD!A:J,10,FALSE)/10000","v":1.6738},{"$f":"VLOOKUP(A26,MD!A:K,11,FALSE)/10000","v":-0.15040000000000001},-45120,0,-45120,0,{"$f":"VLOOKUP(A26,MD!A:R,18,FALSE)/100","v":850},{"$f":"VLOOKUP(A26,MD!A:G,7,FALSE)/10+VLOOKUP(A26,MD!A:L,12,FALSE)/100","v":1057.03}]
["RU000A0JXSD3",100000,{"$f":"VLOOKUP(A27,MD!A:C,2,FALSE)","v":"ВлгОб35007"},{"$f":"VLOOKUP(A27,MD!A:C,3,FALSE)","v":"Облфин"},{"$f":"VLOOKUP(A27,MD!A:R,17,FALSE)","v":"2024-06-02"},2.4657534246575343,3,{"$f":"VLOOKUP(A27,MD!A:H,8,FALSE)/100","v":7.15},{"$f":"(VLOOKUP(A27,MD!A:T,$P$8,FALSE)*Q27/10000)*B27/1000000","v":91.944000000000003},{"$f":"VLOOKUP(A27,MD!A:I,9,FALSE)/10000","v":1.915},{"$f":"VLOOKUP(A27,MD!A:J,10,FALSE)/10000","v":1.7871999999999999},{"$f":"VLOOKUP(A27,MD!A:K,11,FALSE)/10000","v":-0.1656},-16560,0,-16560,0,{"$f":"VLOOKUP(A27,MD!A:R,18,FALSE)/100","v":900},{"$f":"VLOOKUP(A27,MD!A:G,7,FALSE)/10+VLOOKUP(A27,MD!A:L,12,FALSE)/100","v":1029.27},null,"Процентные свопы"]
["RU000A0JXT41",100000,{"$f":"VLOOKUP(A28,MD!A:C,2,FALSE)","v":"СамарОбл13"},{"$f":"VLOOKUP(A28,MD!A:C,3,FALSE)","v":"МинУфСамарОб"},{"$f":"VLOOKUP(A28,MD!A:R,17,FALSE)","v":"2024-05-31"},2.4602739726027396,3,{"$f":"VLOOKUP(A28,MD!A:H,8,FALSE)/100","v":5.59},{"$f":"(VLOOKUP(A28,MD!A:T,$P$8,FALSE)*Q28/10000)*B28/1000000","v":68.516499999999994},{"$f":"VLOOKUP(A28,MD!A:I,9,FALSE)/10000","v":2.1232000000000002},{"$f":"VLOOKUP(A28,MD!A:J,10,FALSE)/10000","v":2.0108000000000001},{"$f":"VLOOKUP(A28,MD!A:K,11,FALSE)/10000","v":-0.1384},-13840,0,-13840,0,{"$f":"VLOOKUP(A28,MD!A:R,18,FALSE)/100","v":650},{"$f":"VLOOKUP(A28,MD!A:G,7,FALSE)/10+VLOOKUP(A28,MD!A:L,12,FALSE)/100","v":1058.81},null,"Своп","Свой объем позиции, млн","Расчетный Объем позиции, млн","Срок, лет","Ставка","DV01 ","Сделка"]
["RU000A0JXQK2",100000,{"$f":"VLOOKUP(A29,MD!A:C,2,FALSE)","v":"Роснфт1P4"},{"$f":"VLOOKUP(A29,MD!A:C,3,FALSE)","v":"Роснефть"},{"$f":"VLOOKUP(A29,MD!A:R,17,FALSE)","v":"2023-04-27"},1.3643835616438356,3,{"$f":"VLOOKUP(A29,MD!A:H,8,FALSE)/100","v":6.29},{"$f":"(VLOOKUP(A29,MD!A:T,$P$8,FALSE)*Q29/10000)*B29/1000000","v":104.75},{"$f":"VLOOKUP(A29,MD!A:I,9,FALSE)/10000","v":1.8986000000000001},{"$f":"VLOOKUP(A29,MD!A:J,10,FALSE)/10000","v":1.7862},{"$f":"VLOOKUP(A29,MD!A:K,11,FALSE)/10000","v":-0.1933},-19330,0,-19330,0,{"$f":"VLOOKUP(A29,MD!A:R,18,FALSE)/100","v":1000},{"$f":"VLOOKUP(A29,MD!A:G,7,FALSE)/10+VLOOKUP(A29,MD!A:L,12,FALSE)/100","v":1082.1399999999999},null,"IRS1Y",-49,{"$f":"IF(M14>0,ROUND(E6/Y29*$I$13,0),0)","v":-450},1,7.0000000000000007E-2,{"$f":"PV(X29,W29,0.01%)*10^6","v":-93.457943925233735},{"$f":"IF(V29>0,\"ОТДАЮ MOSPRIME 3M/ПОЛУЧАЮ ФИКС\",\"ПОЛУЧАЮ MOSPRIME 3M/ОТДАЮ ФИКС\")","v":"ПОЛУЧАЮ MOSPRIME 3M/ОТДАЮ ФИКС"}]
["RU000A0ZYFC6",100000,{"$f":"VLOOKUP(A30,MD!A:C,2,FALSE)","v":"МТС 001P-3"},{"$f":"VLOOKUP(A30,MD!A:C,3,FALSE)","v":"МТС"},{"$f":"VLOOKUP(A30,MD!A:R,17,FALSE)","v":"2022-11-03"},0.8849315068493151,1,{"$f":"VLOOKUP(A30,MD!A:H,8,FALSE)/100","v":6.14},{"$f":"(VLOOKUP(A30,MD!A:T,$P$8,FALSE)*Q30/10000)*B30/1000000","v":104.29000000000002},{"$f":"VLOOKUP(A30,MD!A:I,9,FALSE)/10000","v":1.5041},{"$f":"VLOOKUP(A30,MD!A:J,10,FALSE)/10000","v":1.417},{"$f":"VLOOKUP(A30,MD!A:K,11,FALSE)/10000","v":-0.14940000000000001},-14940,0,-14940,0,{"$f":"VLOOKUP(A30,MD!A:R,18,FALSE)/100","v":1000},{"$f":"VLOOKUP(A30,MD!A:G,7,FALSE)/10+VLOOKUP(A30,MD!A:L,12,FALSE)/100","v":1054.43},null,"IRS3Y",-146,{"$f":"ROUND(E7/Y30*$I$13*$M$14/100,0)","v":-182},3,0.08,{"$f":"PV(X30,W30,0.01%)*10^6","v":-257.70969872478804},{"$f":"IF(V30>0,\"ОТДАЮ MOSPRIME 3M/ПОЛУЧАЮ ФИКС\",\"ПОЛУЧАЮ MOSPRIME 3M/ОТДАЮ ФИКС\")","v":"ПОЛУЧАЮ MOSPRIME 3M/ОТДАЮ ФИКС"}]
{"$rows_left_out":7}
{"sheet":"TempPort","index":3,"n_rows":28,"n_cols":2,"rows_kept":28,"cut":false,"hidden":false,"merged":[]}
["RU000A0ZYDD9",100000]
["RU000A0JXZB2",100000]
["RU000A0ZYFB8",100000]
["RU000A0ZYCM2",100000]
["RU000A0ZYB40",100000]
["RU000A0JXYS9",100000]
["RU000A0JXTW1",300000]
["RU000A0JXSD3",100000]
["RU000A0JXT41",100000]
["RU000A0JXQK2",100000]
["RU000A0ZYFC6",100000]
["RU000A0ZYDQ1",100000]
["RU000A0JXQ28",100000]
["RU000A0ZYDS7",100000]
["RU000A0ZYC98",100000]
["RU000A0JXVE5",100000]
["RU000A0JXPN8",100000]
["RU000A0JXU71",100000]
["RU000A0JXRW5",100000]
["RU000A0JXM97",100000]
["RU000A0JXQD7",100000]
["RU000A0ZYEB1",100000]
["RU000A0JXMQ8",100000]
["RU000A0JXS75",100000]
["RU000A0JXRN4",100000]
["RU000A0JXD07",100000]
["RU000A0JXRP9",100000]
["RU000A0JXFM1",250000]